NPDerivativeChecker: Checking at given x.

5 jobs for ps in 2 minutes and 31 seconds (queued for 1 second)
latest
Status Job ID Name Coverage
  Test
failed #51209
Qt551 VS2013
CoMISo-VS2013-Qt-5.5.1-x64

00:01:05

failed #51207
Linux
clang-c++11

00:02:30

failed #51206
Linux
gcc-c++11

00:02:14

failed #51208
Apple
macos-c++11

00:01:53

 
  Deploy
skipped #51210
trigger_build
 
Name Stage Failure
failed
clang-c++11 Test
       ^
18 warnings and 1 error generated.
Examples/small_nsolver/CMakeFiles/small_nsolver.dir/build.make:62: recipe for target 'Examples/small_nsolver/CMakeFiles/small_nsolver.dir/main.cc.o' failed
make[2]: *** [Examples/small_nsolver/CMakeFiles/small_nsolver.dir/main.cc.o] Error 1
CMakeFiles/Makefile2:374: recipe for target 'Examples/small_nsolver/CMakeFiles/small_nsolver.dir/all' failed
make[1]: *** [Examples/small_nsolver/CMakeFiles/small_nsolver.dir/all] Error 2
Makefile:127: recipe for target 'all' failed
make: *** [all] Error 2
ERROR: Job failed: exit status 1
failed
gcc-c++11 Test
   npd.check_all(&snp);
^
Examples/small_nsolver/CMakeFiles/small_nsolver.dir/build.make:62: recipe for target 'Examples/small_nsolver/CMakeFiles/small_nsolver.dir/main.cc.o' failed
make[2]: *** [Examples/small_nsolver/CMakeFiles/small_nsolver.dir/main.cc.o] Error 1
CMakeFiles/Makefile2:374: recipe for target 'Examples/small_nsolver/CMakeFiles/small_nsolver.dir/all' failed
make[1]: *** [Examples/small_nsolver/CMakeFiles/small_nsolver.dir/all] Error 2
Makefile:127: recipe for target 'all' failed
make: *** [all] Error 2
ERROR: Job failed: exit status 1
failed
macos-c++11 Test
       ^
/Users/jenkins/builds/b72f60fc/0/CoMISo/CoMISo/../CoMISo/NSolver/NPDerivativeChecker.hh:72:8: note: candidate function template not viable: requires 2 arguments, but 1 was provided
bool check_all(ProblemInterface* _np, const double* _x)
^
1 error generated.
make[2]: *** [Examples/small_nsolver/CMakeFiles/small_nsolver.dir/main.cc.o] Error 1
make[1]: *** [Examples/small_nsolver/CMakeFiles/small_nsolver.dir/all] Error 2
make: *** [all] Error 2
ERROR: Job failed: exit status 1
failed
CoMISo-VS2013-Qt-5.5.1-x64 Test
9>  small_factored_solver.vcxproj -> E:\gitlab\builds\7949bd93\0\CoMISo\CoMISo\rel\Examples\small_factored_example\Release\small_factored_solver.exe
16> small_quadratic_solver.vcxproj -> E:\gitlab\builds\7949bd93\0\CoMISo\CoMISo\rel\Examples\small_quadratic_example\Release\small_quadratic_solver.exe
15> Creating library E:/gitlab/builds/7949bd93/0/CoMISo/CoMISo/rel/Examples/small_quadratic_resolve_example/Release/small_quadratic_resolve.lib and object E:/gitlab/builds/7949bd93/0/CoMISo/CoMISo/rel/Examples/small_quadratic_resolve_example/Release/small_quadratic_resolve.exp
15> small_quadratic_resolve.vcxproj -> E:\gitlab\builds\7949bd93\0\CoMISo\CoMISo\rel\Examples\small_quadratic_resolve_example\Release\small_quadratic_resolve.exe
18>------ Build started: Project: ALL_BUILD, Configuration: Release x64 ------
18> Building Custom Rule E:/gitlab/builds/7949bd93/0/CoMISo/CoMISo/CMakeLists.txt
18> CMake does not need to re-run because E:/gitlab/builds/7949bd93/0/CoMISo/CoMISo/rel/CMakeFiles/generate.stamp is up-to-date.
========== Build: 12 succeeded, 6 failed, 0 up-to-date, 0 skipped ==========
ERROR: Job failed: exit status 1