add GUROBI and CPLEX to the small_nleast_squares examples

8 jobs for readme-and-logo in 6 minutes and 58 seconds
Status Job ID Name Coverage
  Test
passed #29886
Qt551 VS2013
CoMISo-VS2013-Qt-5.5.1-x64

00:01:12

passed #29881
Linux
clang-c++11

00:06:44

failed #29883
Linux
clang-c++98

00:00:15

passed #29880
Linux
gcc-c++11

00:06:57

passed #29882
Linux
gcc-c++98

00:06:52

passed #29884
Apple
macos-c++11

00:02:43

passed #29885
Apple
macos-c++98

00:02:12

 
  Deploy
skipped #29887
trigger_build
 
Name Stage Failure
failed
clang-c++98 Test There is an unknown failure, please try again
fatal error: too many errors emitted, stopping now [-ferror-limit=]
20 errors generated.
CMakeFiles/CoMISo.dir/build.make:302: recipe for target 'CMakeFiles/CoMISo.dir/Solver/CholmodSolver.cc.o' failed
make[2]: *** [CMakeFiles/CoMISo.dir/Solver/CholmodSolver.cc.o] Error 1
CMakeFiles/Makefile2:99: recipe for target 'CMakeFiles/CoMISo.dir/all' failed
make[1]: *** [CMakeFiles/CoMISo.dir/all] Error 2
Makefile:127: recipe for target 'all' failed
make: *** [all] Error 2
ERROR: Job failed: exit status 1