Add all other destinations to install target

6 jobs for master in 19 minutes and 57 seconds
Status Job ID Name Coverage
  Test
passed #7620
Linux
clang-c++11

00:04:52

passed #7622
Linux
clang-c++98

00:03:58

passed #7619
Linux
gcc-c++11

00:05:55

passed #7621
Linux
gcc-c++98

00:04:29

failed #7623
Apple
macos-c++11

00:00:20

failed #7624
Apple
macos-c++98

00:00:20

 
Name Stage Failure
failed
macos-c++98 Test There is an unknown failure, please try again
/Users/jenkins/sw/gmm-4.1/include/gmm/gmm_blas_interface.h:159:32: warning: 'zdotc_' has C-linkage specified, but returns user-defined type 'std::complex<double>' which is incompatible with C [-Wreturn-type-c-linkage]
BLAS_C cdotc_(...); BLAS_Z zdotc_(...);
^
4 warnings and 4 errors generated.
make[2]: *** [CMakeFiles/CoMISo.dir/Solver/CholmodSolver.cc.o] Error 1
make[1]: *** [CMakeFiles/CoMISo.dir/all] Error 2
make: *** [all] Error 2

ERROR: Build failed: exit status 1
failed
macos-c++11 Test There is an unknown failure, please try again
      msg << "Level " << level_ << " Warning in "__FILE__ << ", line " \
^
fatal error: too many errors emitted, stopping now [-ferror-limit=]
20 errors generated.
make[2]: *** [CMakeFiles/CoMISo.dir/Solver/CholmodSolver.cc.o] Error 1
make[1]: *** [CMakeFiles/CoMISo.dir/all] Error 2
make: *** [all] Error 2

ERROR: Build failed: exit status 1