export CoMISo targets

6 jobs for CMakeTarget in 2 minutes and 1 second
Status Job ID Name Coverage
  Test
failed #68291
Qt551 VS2013
CoMISo-VS2013-Qt-5.5.1-x64

00:00:16

failed #68292
IPOPT3129 VS2017
CoMISo-VS2017-Qt-5.10.1-x64

00:00:21

failed #68289
Linux
clang-c++11

00:00:09

failed #68288
Linux
gcc-c++11

00:00:05

failed #68290
Apple
macos-c++11

00:01:44

 
  Deploy
skipped #68293
trigger_build
 
Name Stage Failure
failed
CoMISo-VS2013-Qt-5.5.1-x64 Test
* ACG Buildsystem                                          *
* *
* Package : CoMISo *
* Version : 1.1 *
************************************************************
-- Configuring incomplete, errors occurred!
See also "E:/gitlab/builds/1900f1de/0/CoMISo/CoMISo/rel/CMakeFiles/CMakeOutput.log".
See also "E:/gitlab/builds/1900f1de/0/CoMISo/CoMISo/rel/CMakeFiles/CMakeError.log".
ERROR: Job failed: exit status 1
failed
macos-c++11 Test
[ 61%] Building CXX object CMakeFiles/CoMISo.dir/Utils/CoMISoError.cc.o
[ 62%] Building CXX object CMakeFiles/CoMISo.dir/QtWidgets/MISolverDialogUI.cc.o
[ 63%] Linking CXX shared library libCoMISo.dylib
ld: library not found for -lSuiteSparse
clang: error: linker command failed with exit code 1 (use -v to see invocation)
make[2]: *** [libCoMISo.dylib] Error 1
make[1]: *** [CMakeFiles/CoMISo.dir/all] Error 2
make: *** [all] Error 2
ERROR: Job failed: exit status 1
failed
CoMISo-VS2017-Qt-5.10.1-x64 Test
* ACG Buildsystem                                          *
* *
* Package : CoMISo *
* Version : 1.1 *
************************************************************
-- Configuring incomplete, errors occurred!
See also "E:/gitlab/builds/9d73ae51/0/CoMISo/CoMISo/rel/CMakeFiles/CMakeOutput.log".
See also "E:/gitlab/builds/9d73ae51/0/CoMISo/CoMISo/rel/CMakeFiles/CMakeError.log".
ERROR: Job failed: exit status 1
failed
clang-c++11 Test
* ACG Buildsystem                                          *
* *
* Package : CoMISo *
* Version : 1.1 *
************************************************************
-- Configuring incomplete, errors occurred!
See also "/local/gitlab-runner/builds/63e68e74/1/CoMISo/CoMISo/build-release-clang-cpp11/CMakeFiles/CMakeOutput.log".
See also "/local/gitlab-runner/builds/63e68e74/1/CoMISo/CoMISo/build-release-clang-cpp11/CMakeFiles/CMakeError.log".
ERROR: Job failed: exit status 1
failed
gcc-c++11 Test
* ACG Buildsystem                                          *
* *
* Package : CoMISo *
* Version : 1.1 *
************************************************************
-- Configuring incomplete, errors occurred!
See also "/local/gitlab-runner/builds/63e68e74/0/CoMISo/CoMISo/build-release-gcc-cpp11/CMakeFiles/CMakeOutput.log".
See also "/local/gitlab-runner/builds/63e68e74/0/CoMISo/CoMISo/build-release-gcc-cpp11/CMakeFiles/CMakeError.log".
ERROR: Job failed: exit status 1