Added max_linesearch_iters option to NewtonSolver.

8 jobs for ps_old in 7 minutes and 3 seconds
latest
Status Job ID Name Coverage
  Test
failed #51162
Qt551 VS2013
CoMISo-VS2013-Qt-5.5.1-x64

00:00:05

passed #51157
Linux
clang-c++11

00:04:34

failed #51159
Linux
clang-c++98

00:00:19

passed #51156
Linux
gcc-c++11

00:06:58

passed #51158
Linux
gcc-c++98

00:07:02

passed #51160
Apple
macos-c++11

00:04:45

failed #51161
Apple
macos-c++98

00:00:42

 
  Deploy
skipped #51163
trigger_build
 
Name Stage Failure
failed
macos-c++98 Test
            ^
/Users/jenkins/builds/8dfb9a4a/0/CoMISo/CoMISo/NSolver/LBFGSSolver.cc:113:9: warning: 'auto' type specifier is a C++11 extension [-Wc++11-extensions]
auto delta_f = f - newf;
^
25 warnings and 2 errors generated.
make[2]: *** [CMakeFiles/CoMISo.dir/NSolver/LBFGSSolver.cc.o] Error 1
make[1]: *** [CMakeFiles/CoMISo.dir/all] Error 2
make: *** [all] Error 2
ERROR: Job failed: exit status 1
failed
clang-c++98 Test
fatal error: too many errors emitted, stopping now [-ferror-limit=]
20 errors generated.
CMakeFiles/CoMISo.dir/build.make:302: recipe for target 'CMakeFiles/CoMISo.dir/Solver/CholmodSolver.cc.o' failed
make[2]: *** [CMakeFiles/CoMISo.dir/Solver/CholmodSolver.cc.o] Error 1
CMakeFiles/Makefile2:99: recipe for target 'CMakeFiles/CoMISo.dir/all' failed
make[1]: *** [CMakeFiles/CoMISo.dir/all] Error 2
Makefile:127: recipe for target 'all' failed
make: *** [all] Error 2
ERROR: Job failed: exit status 1
failed
CoMISo-VS2013-Qt-5.5.1-x64 Test
 - [deleted]         (none)     -> origin/ps
* [new branch] CMake_to_build_Debug-msvc -> origin/CMake_to_build_Debug-msvc
* [new branch] ps_old -> origin/ps_old
Checking out 519345c8 as ps_old...
Skipping Git submodules setup
$ CI\Windows.bat
'"C:\Program Files (x86)\CMake\bin\cmake.exe"' is not recognized as an internal or external command,
operable program or batch file.
ERROR: Job failed: exit status 9009