Merge from ReForm

5 jobs for merge_from_reform in 2 minutes and 29 seconds (queued for 1 second)
Status Job ID Name Coverage
  Test
failed #33735
Qt551 VS2013
CoMISo-VS2013-Qt-5.5.1-x64

00:00:14

failed #33733
Linux
clang-c++11

00:01:25

failed #33732
Linux
gcc-c++11

00:01:09

passed #33734
Apple
macos-c++11

00:02:27

 
  Deploy
skipped #33736
trigger_build
 
Name Stage Failure
failed
clang-c++11 Test There is an unknown failure, please try again
    ^
1 error generated.
CMakeFiles/CoMISo.dir/build.make:878: recipe for target 'CMakeFiles/CoMISo.dir/NSolver/IPOPTSolverLean.cc.o' failed
make[2]: *** [CMakeFiles/CoMISo.dir/NSolver/IPOPTSolverLean.cc.o] Error 1
CMakeFiles/Makefile2:99: recipe for target 'CMakeFiles/CoMISo.dir/all' failed
make[1]: *** [CMakeFiles/CoMISo.dir/all] Error 2
Makefile:127: recipe for target 'all' failed
make: *** [all] Error 2
ERROR: Job failed: exit status 1
failed
gcc-c++11 Test There is an unknown failure, please try again
     PROGRESS_RESUME_ABORT; // ... so check if we need to resume it
^~~~~~~~~~~~~~~~~~~~~
CMakeFiles/CoMISo.dir/build.make:878: recipe for target 'CMakeFiles/CoMISo.dir/NSolver/IPOPTSolverLean.cc.o' failed
make[2]: *** [CMakeFiles/CoMISo.dir/NSolver/IPOPTSolverLean.cc.o] Error 1
CMakeFiles/Makefile2:99: recipe for target 'CMakeFiles/CoMISo.dir/all' failed
make[1]: *** [CMakeFiles/CoMISo.dir/all] Error 2
Makefile:127: recipe for target 'all' failed
make: *** [all] Error 2
ERROR: Job failed: exit status 1
failed
CoMISo-VS2013-Qt-5.5.1-x64 Test There is an unknown failure, please try again
-- Boost not found!
-- Could NOT find GMM (missing: GMM_INCLUDE_DIR)
CMake Error at CMakeLists.txt:72 (message):
GMM not found!


-- Configuring incomplete, errors occurred!
See also "E:/gitlab/builds/7949bd93/0/CoMISo/CoMISo/rel/CMakeFiles/CMakeOutput.log".
ERROR: Job failed: exit status 1