add stdout output options and some documentation

8 jobs for lbfgs in 6 minutes and 31 seconds
latest
Status Job ID Name Coverage
  Test
passed #30424
Qt551 VS2013
CoMISo-VS2013-Qt-5.5.1-x64

00:00:57

passed #30419
Linux
clang-c++11

00:04:23

failed #30421
Linux
clang-c++98

00:00:16

passed #30418
Linux
gcc-c++11

00:04:18

passed #30420
Linux
gcc-c++98

00:06:30

passed #30422
Apple
macos-c++11

00:02:24

failed #30423
Apple
macos-c++98

00:00:29

 
  Deploy
skipped #30425
trigger_build
 
Name Stage Failure
failed
macos-c++98 Test There is an unknown failure, please try again
            ^
/Users/jenkins/builds/8dfb9a4a/0/CoMISo/CoMISo/NSolver/LBFGSSolver.cc:121:9: warning: 'auto' type specifier is a C++11 extension [-Wc++11-extensions]
auto delta_f = f - newf;
^
27 warnings and 2 errors generated.
make[2]: *** [CMakeFiles/CoMISo.dir/NSolver/LBFGSSolver.cc.o] Error 1
make[1]: *** [CMakeFiles/CoMISo.dir/all] Error 2
make: *** [all] Error 2
ERROR: Job failed: exit status 1
failed
clang-c++98 Test There is an unknown failure, please try again
fatal error: too many errors emitted, stopping now [-ferror-limit=]
20 errors generated.
CMakeFiles/CoMISo.dir/build.make:302: recipe for target 'CMakeFiles/CoMISo.dir/Solver/CholmodSolver.cc.o' failed
make[2]: *** [CMakeFiles/CoMISo.dir/Solver/CholmodSolver.cc.o] Error 1
CMakeFiles/Makefile2:99: recipe for target 'CMakeFiles/CoMISo.dir/all' failed
make[1]: *** [CMakeFiles/CoMISo.dir/all] Error 2
Makefile:127: recipe for target 'all' failed
make: *** [all] Error 2
ERROR: Job failed: exit status 1