added qr solver to newton

8 jobs for NewtonWithQR in 7 minutes and 1 second
latest
Status Job ID Name Coverage
  Test
passed #29034
Qt551 VS2013
CoMISo-VS2013-Qt-5.5.1-x64

00:01:28

passed #29029
Linux
clang-c++11

00:06:49

failed #29031
Linux
clang-c++98

00:00:21

passed #29028
Linux
gcc-c++11

00:03:36

passed #29030
Linux
gcc-c++98

00:07:01

passed #29032
Apple
macos-c++11

00:02:44

failed #29033
Apple
macos-c++98

00:00:35

 
  Deploy
skipped #29035
trigger_build
 
Name Stage Failure
failed
macos-c++98 Test There is an unknown failure, please try again
/Users/jenkins/builds/8dfb9a4a/0/CoMISo/CoMISo/NSolver/NewtonSolver.hh:153:51: error: a space is required between consecutive right angle brackets (use '> >')
Eigen::SparseQR<SMatrixD, Eigen::AMDOrdering<int>> qr_solver_;
^~
> >
1 error generated.
make[2]: *** [CMakeFiles/CoMISo.dir/NSolver/NewtonSolver.cc.o] Error 1
make[1]: *** [CMakeFiles/CoMISo.dir/all] Error 2
make: *** [all] Error 2
ERROR: Job failed: exit status 1
failed
clang-c++98 Test There is an unknown failure, please try again
fatal error: too many errors emitted, stopping now [-ferror-limit=]
20 errors generated.
CMakeFiles/CoMISo.dir/build.make:302: recipe for target 'CMakeFiles/CoMISo.dir/Solver/CholmodSolver.cc.o' failed
make[2]: *** [CMakeFiles/CoMISo.dir/Solver/CholmodSolver.cc.o] Error 1
CMakeFiles/Makefile2:99: recipe for target 'CMakeFiles/CoMISo.dir/all' failed
make[1]: *** [CMakeFiles/CoMISo.dir/all] Error 2
Makefile:127: recipe for target 'all' failed
make: *** [all] Error 2
ERROR: Job failed: exit status 1