fixed bug in constraint conversion for empty constraint vector

5 jobs for cgg2 in 4 minutes and 6 seconds (queued for 1 second)
Status Job ID Name Coverage
  Test
failed #121155
IPOPT3129 VS2017
CoMISo-VS2017-Qt-5.10.1-x64

00:00:15

passed #121153
Linux
clang-c++11

00:04:00

passed #121152
Linux
gcc-c++11

00:04:06

failed #121154
Apple
macos-c++11

00:00:19

 
  Deploy
skipped #121156
trigger_build
 
Name Stage Failure
failed
macos-c++11 Test
      gmm::mat_row(d_tmp, row_ordering[i]).swap(gmm::mat_row(rhs_update_table_.D_, i));
~~~~~~~~~~~~~~~~~~~~~~~~~~~~~~~~~~~~ ^
1 error generated.
make[2]: *** [CMakeFiles/CoMISo.dir/Solver/ConstrainedSolver.cc.o] Error 1
make[1]: *** [CMakeFiles/CoMISo.dir/all] Error 2
make: *** [all] Error 2
Running after_script
Uploading artifacts for failed job
ERROR: Job failed: exit status 1
failed
CoMISo-VS2017-Qt-5.10.1-x64 Test


-- Configuring incomplete, errors occurred!
See also "E:/gitlab/builds/mJQzyNSJ/0/CoMISo/CoMISo/rel/CMakeFiles/CMakeOutput.log".
See also "E:/gitlab/builds/mJQzyNSJ/0/CoMISo/CoMISo/rel/CMakeFiles/CMakeError.log".

E:\gitlab\builds\mJQzyNSJ\0\CoMISo\CoMISo\rel>IF 1 NEQ 0 exit /b 1
Cleaning up file based variables
ERROR: Job failed: exit status 1